{"text_format":"1","workbook":"xlsx","n_sheets":2,"sheets":["Formato","Catálogo"],"not_rendered":{"charts":0,"images":1,"macros":1,"external_links":0,"defined_names":2,"comments":0,"pivot_tables":0},"unopened":[],"bounds":{"document_bytes":16777216,"sheet_cells":100000,"rows_first":2000,"rows_last":500,"rows_between":2000,"halvings":0,"cell_chars":16384,"cell_head_chars":4096},"cells_cut":0,"cells_raw":0,"read":"whole","date_system":"1900"}

{"sheet":"Formato","index":0,"n_rows":111,"n_cols":8,"rows_kept":111,"cut":false,"hidden":false,"merged":[[0,0,0,7],[2,0,2,7],[4,0,4,6],[5,0,5,6]]}
["Lineamiento tercero, fracción XII. Reporte detallado sobre actividades y campañas de capacitación realizadas."]
["Normatividad aplicable a:"]
["El Colegio de San Luis, A.C."]
[null,null,null,null,null,null,null,{"$f":"IF(A3=\"Seleccione el nombre del sujeto obligado\",\"\",VLOOKUP(A3,Catálogo!B1:C880,2,0))","v":"53123"}]
["Trimestre que informa ",null,null,null,null,null,null,"2° 2023"]
["Durante el trimestre que informa. ¿Se realizaron actividades y/o campañas de capacitación?",null,null,null,null,null,null,"Si"]
[]
["Mes en el que se realizó el evento\n(seleccionar)","Nombre del evento","Temática del evento\n(seleccionar)","Número de servidores públicos asistentes","Institución que provee la capacitación","Tipo de evento\n(seleccionar)","# sesiones impartidas","# horas impartidas"]
["Abril","Contraloria Social","Otro ",3,"Función Pública","Curso en línea",1,4]
["Abril","Aplicación de Principios Penales en el Ámbito Disciplinario","Otro ",2,"Función Pública","Curso en línea",1,3]
["Abril","Buscador de Género","Equidad de género ",2,"INAI","Curso en línea",1,4]
["Abril","Ética en la Administración Pública Federal","Ética Pública",1,"Inai","Curso en línea",1,20]
["Mayo","Semana de la Contaduria","Ética Pública",4,"Colegio de Contadores Públicos","Curso presencial",4,4.5]
[]
["Junio","Gestión Documental en la Administración Pública Federal","Otro ",1,"Función Pública","Curso en línea",1,10]
["Junio","Sistema de Ciudadanos Alertadores Internos y Externos de la Corrupción","Otro ",1,"Función Pública","Curso en línea",1,10]
[]
[]
["Junio","Responsabilidades Administrativas de las personas servidoras publicas","Otro ",2,"Función Pública","Curso en línea",1,20]
["Junio","Esquemas de Mejores Practicas en Materia de Protección de Datos  Personales","Otro ",1,"INAI","Curso en línea",1,4]
["Junio","Administración Pública Federal Libre de Violencia, Combate a la Acoso Sexul y al HS","Otro ",1,null,"Curso en línea",1,8]
[]
[]
[]
[]
[]
[]
[]
[]
[]
[]
[]
[]
[]
[]
[]
[]
["Junio"]
[]
[]
[]
[]
[]
[]
[]
[]
[]
[]
[]
[]
[]
[]
[]
[]
[]
[]
[]
[]
[]
[]
[]
[]
[]
[]
[]
[]
[]
[]
[]
[]
[]
[]
[]
[]
[]
[]
[]
[]
[]
[]
[]
[]
[]
[]
[]
[]
[]
[]
[]
[]
[]
[]
[]
[]
[]
[]
[]
[]
[]
[]
[]
[]
[]
[]
[]
[]
[]
[]
[]
[]
[{"$f":"COUNTA(Tabla1[Mes en el que se realizó el evento\n(seleccionar)])","v":11},null,{"$f":"COUNTA(Tabla1[Temática del evento\n(seleccionar)])","v":10},{"$f":"SUM(Tabla1[Número de servidores públicos asistentes])","v":18},{"$f":"COUNTA(Tabla1[Institución que provee la capacitación])","v":9},{"$f":"COUNTA(Tabla1[Tipo de evento\n(seleccionar)])","v":10},{"$f":"SUM(Tabla1['# sesiones impartidas])","v":13},{"$f":"SUM(Tabla1['# horas impartidas])","v":87.5}]

{"sheet":"Catálogo","index":1,"n_rows":846,"n_cols":11,"rows_kept":846,"cut":false,"hidden":true,"merged":[]}
["No","Seleccione el nombre del sujeto obligado","Cve",null,"Seleccionar","Seleccionar","Tipo de evento","Temática del evento",null,null,{"$f":"IF(Formato!H5=\"Seleccionar\",0,MID(Formato!H5,1,1))","v":"2"}]
[1,"9/11 de la recaudación por concepto de las cuotas establecidas en el artículo 2°A. Fracción II de la Ley del Impuesto Especial sobre Producción y Servicios","06005",null,"4° 2020","Si","Asesoría","Atención a las Solicitudes de Ejercicio de Derechos ARCO (ASEDARCO)",null,null,{"$f":"IF(VALUE(K1)=1,\"Enero\",IF(VALUE(K1)=2,\"Abril\",IF(VALUE(K1)=3,\"Julio\",IF(VALUE(K1)=4,\"Octubre\",\"Seleccionar en celda H5 el trimestre a informar\"))))","v":"Abril"}]
[2,"Administración de los recursos producto de la venta de publicaciones de la Suprema Corte para el financiamiento de nuevas publicaciones y cualquier proyecto de interés para el fideicomitente","03301",null,"1° 2021","No","Conferencia","Autorregulación en Materia de Protección de Datos Personales en México y Reglas de Operación del Registro de Esquemas de Autorregulación (AMPDM)",null,null,{"$f":"IF(K2=\"Enero\",\"Febrero\",IF(K2=\"Abril\",\"Mayo\",IF(K2=\"Julio\",\"Agosto\",IF(K2=\"Octubre\",\"Noviembre\",\"Seleccionar en celda H5 el trimestre a informar\"))))","v":"Mayo"}]
[3,"Administración del Patrimonio de la Beneficencia Pública (*)","12001","","2° 2021",null,"Curso en línea","Aviso de Privacidad",null,null,{"$f":"IF(K3=\"Febrero\",\"Marzo\",IF(K3=\"Mayo\",\"Junio\",IF(K3=\"Agosto\",\"Septiembre\",IF(K3=\"Noviembre\",\"Diciembre\",\"Seleccionar en celda H5 el trimestre a informar\"))))","v":"Junio"}]
[4,"Administración Portuaria Integral de Altamira, S.A. de C.V.","09176","","3° 2021",null,"Curso presencial","Clasificación y Desclasificación de la Información"]
[5,"Administración Portuaria Integral de Coatzacoalcos, S.A. de C.V.","09183",null,"4° 2021",null,"Diplomado","Cultura Organizacional"]
[6,"Administración Portuaria Integral de Dos Bocas, S.A. de C.V.","09180","","1° 2022",null,"Seminario","Descripción archivística"]
[7,"Administración Portuaria Integral de Ensenada, S.A. de C.V.","09169","","2° 2022",null,"Taller","Equidad de género "]
[8,"Administración Portuaria Integral de Guaymas, S.A. de C.V.","09177","","3° 2022",null,"Otro","Ética Pública"]
[9,"Administración Portuaria Integral de Lázaro Cárdenas, S.A. de C.V.","09178",null,"4° 2022",null,null,"Gobierno Abierto y Transparencia Proactiva"]
[10,"Administración Portuaria Integral de Manzanillo, S.A. de C.V.","09179","","1° 2023",null,null,"Guía instructiva para el uso del SIPOT."]
[11,"Administración Portuaria Integral de Mazatlán, S.A. de C.V.","09171","","2° 2023",null,null,"Introducción a la Administración Pública Mexicana"]
[12,"Administración Portuaria Integral de Progreso, S.A. de C.V.","09172","","3° 2023",null,null,"Introducción a la Ley Federal de Transparencia y Acceso a la Información Pública"]
[13,"Administración Portuaria Integral de Puerto Madero, S.A. de C.V.","09186","","4° 2023",null,null,"Introducción a la Ley General de Transparencia y Acceso a la Información Pública"]
[14,"Administración Portuaria Integral de Puerto Vallarta, S.A. de C.V.","09173","","1° 2024",null,null,"Introducción al Sistema Nacional Anticorrupción"]
[15,"Administración Portuaria Integral de Salina Cruz, S.A. de C.V.","09184","","2° 2024",null,null,"Jornadas Técnicas de Acompañamiento y Asesoría Especializada"]
[16,"Administración Portuaria Integral de Tampico, S.A. de C.V.","09181","","3° 2024",null,null,"Ley General de Protección de Datos Personales en Posesión de Sujetos Obligados"]
[17,"Administración Portuaria Integral de Topolobampo, S.A. de C.V.","09174","","4° 2024",null,null,"Medios de Impugnación y Criterios del Pleno"]
[18,"Administración Portuaria Integral de Tuxpan, S.A. de C.V.","09175","",null,null,null,"Metodología para el diseño, formulación de sistemas de clasificación y ordenación archivística"]
[19,"Administración Portuaria Integral de Veracruz, S.A. de C.V.","09182","",null,null,null,"Metodología para la valoración y disposición documental"]
[20,"Aeropuerto Internacional de la Ciudad de México, S.A. de C.V.","09451","",null,null,null,"Organización y Conservación de los Archivos de las Dependencias y Entidades de la Administración Pública Federal"]
[21,"Aeropuerto Internacional Felipe Ángeles, S.A. de C.V.",7003,"",null,null,null,"Otro "]
[22,"Aeropuertos y Servicios Auxiliares","09085","",null,null,null,"Prevención de la Discriminación"]
[23,"Agencia Espacial Mexicana","09087","",null,null,null,"Procedimiento de Impugnación y Criterios del Pleno "]
[24,"Agencia Federal de Aviación Civil","09012","",null,null,null,"Reforma Constitucional en Materia de Transparencia"]
[25,"Agencia Mexicana de Cooperación Internacional para el Desarrollo (*)","05100","",null,null,null,"Sensibilización para la Transparencia y Rendición de Cuentas."]
[26,"Agencia Nacional de Seguridad Industrial y de Protección al Medio Ambiente del Sector Hidrocarburos","16211","",null,null,null,"Tratamiento de datos biométricos y manejo de incidentes de seguridad de datos personales"]
[27,"Agencia Reguladora del Transporte Ferroviario (*)","09010",""]
[28,"Agroasemex, S.A.","06084",""]
[29,"Almacenadora Sur, S.A.","64405",""]
[30,"Archivo General de la Nación","04950"]
[31,"Asociación Autónoma del Personal Académico de la Universidad Nacional Autónoma de México","60100",""]
[32,"Asociación Sindical de Oficiales de Máquinas de la Marina Mercante Nacional","60267",""]
[33,"Auditoría Superior de la Federación","01100",""]
[34,"Autoridad Educativa Federal en la Ciudad de México","25101",""]
[35,"Bachillerato general en sus modalidades no escolarizada y mixta","11007"]
[36,"Banco de México","61100",""]
[37,"Banco del Bienestar ","06800",""]
[38,"Banco Nacional de Comercio Exterior, S.N.C.","06305",""]
[39,"Banco Nacional de Obras y Servicios Públicos, S.N.C.","06320"]
[40,"Banco Nacional del Ejército, Fuerza Aérea y Armada, S.N.C.","06325",""]
[41,"Cámara de Diputados","01200",""]
[42,"Caminos y Puentes Federales de Ingresos y Servicios Conexos","09120",""]
[43,"Casa de Moneda de México","06363",""]
[44,"Centro de Capacitación Cinematográfica, A.C.","11063"]
[45,"Centro de Enseñanza Técnica Industrial","11065",""]
[46,"Centro de Estudios para la Preparación y Evaluación Socioeconómica de Proyectos (CEPEP)","06006",""]
[47,"Centro de Ingeniería y Desarrollo Industrial","11121",""]
[48,"Centro de Investigación Científica de Yucatán, A.C.","11108",""]
[49,"Centro de Investigación Científica y de Educación Superior de Ensenada, Baja California","11101",""]
[50,"Centro de Investigación en Alimentación y Desarrollo, A.C.","11083",""]
[51,"Centro de Investigación en Ciencias de Información Geoespacial","11080"]
[52,"Centro de Investigación en Matemáticas, A.C.","11102",""]
[53,"Centro de Investigación en Materiales Avanzados, S.C.","11088",""]
[54,"Centro de Investigación en Química Aplicada","11111",""]
[55,"Centro de Investigación y Asistencia en Tecnología y Diseño del Estado de Jalisco, A.C.","11103",""]
[56,"Centro de Investigación y de Estudios Avanzados del Instituto Politécnico Nacional","11085",""]
[57,"Centro de Investigación y Desarrollo Tecnológico en Electroquímica, S.C.","11106",""]
[58,"Centro de Investigación y Docencia Económicas, A.C.","11090",""]
[59,"Centro de Investigaciones Biológicas del Noroeste, S.C.","11107"]
[60,"Centro de Investigaciones en Óptica, A.C.","11110",""]
[61,"Centro de Investigaciones y Estudios Superiores en Antropología Social","11100",""]
[62,"Centro de Producción de Programas Informativos y Especiales (*)","04001",""]
[63,"Centro Federal de Conciliación y Registro Laboral",14112,""]
[64,"Centro Nacional de Control de Energía","11205",""]
[65,"Centro Nacional de Control del Gas Natural","18112",""]
[66,"Centro Nacional de Equidad de Género y Salud Reproductiva (*)","12002",""]
[67,"Centro Nacional de Excelencia Tecnológica en Salud (*)","12003"]
[68,"Centro Nacional de Inteligencia","04100",""]
[69,"Centro Nacional de la Transfusión Sanguínea (*)","12004",""]
[70,"Centro Nacional de Metrología","10095",""]
[71,"Centro Nacional de Prevención de Desastres","04130",""]
[72,"Centro Nacional de Programas Preventivos y Control de Enfermedades (*)","12005"]
[73,"Centro Nacional de Trasplantes (*)","12006",""]
[74,"Centro Nacional para la Prevención y el Control del VIH/SIDA (*)","12008",""]
[75,"Centro Nacional para la Salud de la Infancia y la Adolescencia (*)","12009",""]
[76,"Centro Regional de Alta Especialidad de Chiapas","12090",""]
[77,"Centros de Integración Juvenil, A.C.","12100"]
[78,"CIATEC, A.C. \"Centro de Innovación Aplicada en Tecnologías Competitivas\"","11105",""]
[79,"CIATEQ, A.C. Centro de Tecnología Avanzada","11104",""]
[80,"Colegio de Bachilleres","11115",""]
[81,"Colegio de Postgraduados","08140",""]
[82,"Colegio Nacional de Educación Profesional Técnica","11125"]
[83,"Colegio Superior Agropecuario del Estado de Guerrero","08609"]
[84,"Comisión de Apelación y Arbitraje del Deporte (*)","11001"]
[85,"Comisión de Operación y Fomento de Actividades Académicas del Instituto Politécnico Nacional","11135"]
[86,"Comisión Ejecutiva de Atención a Víctimas","00633"]
[87,"Comisión Federal de Competencia Económica","10111"]
[88,"Comisión Federal de Electricidad","18164"]
[89,"Comisión Federal para la Protección contra Riesgos Sanitarios","12151"]
[90,"Comisión Nacional Bancaria y de Valores","06100"]
[91,"Comisión Nacional contra las Adicciones (*)","12007"]
[92,"Comisión Nacional de Acuacultura y Pesca","08197"]
[93,"Comisión Nacional de Arbitraje Médico","42207"]
[94,"Comisión Nacional de Áreas Naturales Protegidas","16151"]
[95,"Comisión Nacional de Bioética (*)","12010"]
[96,"Comisión Nacional de Búsqueda de Personas (*)","04016"]
[97,"Comisión Nacional de Cultura Física y Deporte","11131"]
[98,"Comisión Nacional de Hidrocarburos","18001"]
[99,"Comisión Nacional de las Zonas Áridas","20090"]
[100,"Comisión Nacional de Libros de Texto Gratuitos","11137"]
[101,"Comisión Nacional de los Derechos Humanos","35100"]
[102,"Comisión Nacional de los Salarios Mínimos","14075"]
[103,"Comisión Nacional de Mejora Regulatoria","10141"]
[104,"Comisión Nacional de Seguridad Nuclear y Salvaguardias","18100"]
[105,"Comisión Nacional de Seguros y Fianzas","06111"]
[106,"Comisión Nacional de Vivienda","20120"]
[107,"Comisión Nacional del Agua","16101"]
[108,"Comisión Nacional del Sistema de Ahorro para el Retiro","06121"]
[109,"Comisión Nacional Forestal","16161"]
[110,"Comisión Nacional para el Uso Eficiente de la Energía","18191"]
[111,"Comisión Nacional para la Mejora Continua de la Educación","11323"]
[112,"Comisión Nacional para la Protección y Defensa de los Usuarios de Servicios Financieros","06370"]
[113,"Comisión Nacional para Prevenir y Erradicar la Violencia Contra las Mujeres (*)","04002"]
[114,"Comisión Reguladora de Energía","18111"]
[115,"Comité de Participación Ciudadana del Sistema Nacional Anticorrupción",47002]
[116,"Comité Nacional para el Desarrollo Sustentable de la Caña de Azúcar (*)","08001"]
[117,"Compañía Mexicana de Exploraciones, S.A. de C.V.","18200"]
[118,"Compañía Operadora del Centro Cultural y Turístico de Tijuana, S.A. de C.V.","11148"]
[119,"Complemento del Préstamo Especial para el Ahorro (PEA) y préstamos de corto y mediano plazo para jubilados bajo el plan de beneficio definido","06781"]
[120,"Consejería Jurídica del Ejecutivo Federal","02200"]
[121,"Consejo de la Judicatura Federal","03200"]
[122,"Consejo de Promoción Turística de México, S.A. de C. V.",21355]
[123,"Consejo Nacional de Ciencia y Tecnología","11112"]
[124,"Consejo Nacional de Evaluación de la Política de Desarrollo Social","20237"]
[125,"Consejo Nacional de Fomento Educativo","11150"]
[126,"Consejo Nacional para el Desarrollo y la Inclusión de las Personas con Discapacidad","00634"]
[127,"Consejo Nacional para Prevenir la Discriminación","04410"]
[128,"Conservaduría de Palacio Nacional","02101"]
[129,"Contrato de fideicomiso con número 108601 con el Banco Nacional del Ejército, Fuerza Aérea y Armada, S.N.C. (BANJERCITO), para la administración del Fondo por concepto de las aportaciones para el cumplimiento del programa del pasivo laboral","22201"]
[130,"Contrato de mandato para el pago de haberes de retiro, pensiones y compensaciones","07151"]
[131,"Contrato especifico abierto para la construcción y suministro de remolcadores, chalanes y embarcaciones multipropósito para la flota menor de Pemex Refinación","18681"]
[132,"Convenio de cooperación para la operación del Programa de Educación a Distancia","11008"]
[133,"Convenio de cooperación para la operación del Programa de Educación a Distancia II","11009"]
[134,"Convenio específico para la operación y desarrollo del Programa SEPA-Ingles","11010"]
[135,"Coordinación General @prende.mx (*)","11002"]
[136,"Coordinación General de la Comisión Mexicana de Ayuda a Refugiados","04220"]
[137,"Coordinación Nacional Antisecuestro (*)","04003"]
[138,"Coordinación Nacional de Becas para el Bienestar Benito Juárez","20001"]
[139,"Coordinación para la Atención Integral de la Migración en la Frontera Sur (*)","04004"]
[140,"Corporación de Servicios al Turista Ángeles Verdes (*)","21001"]
[141,"Corporación Mexicana de Investigación en Materiales, S.A. de C.V.","11163"]
[142,"Corredor Interoceánico del Istmo deTehuantepec","09008"]
[143,"Diconsa, S.A. de C.V.","20150"]
[144,"Educal, S.A. de C.V.","11186"]
[145,"El 0.136 por ciento de la RFP","06007"]
[146,"El Colegio de la Frontera Norte, A.C.","11075"]
[147,"El Colegio de la Frontera Sur","11109"]
[148,"El Colegio de México, A.C.","11120"]
[149,"El Colegio de Michoacán, A.C.","11187"]
[150,"El Colegio de San Luis, A.C.","53123"]
[151,"Estudios Churubusco Azteca, S.A.","11195"]
[152,"Exportadora de Sal, S.A. de C.V.","10101"]
[153,"Extinta Luz y Fuerza del Centro","06814"]
[154,"F/11025590 (Antes 4483-0) \"Durango-Yerbanis\"","09123"]
[155,"F/1516 ATM (Antes 639-00-5) Tijuana-Tecate","09127"]
[156,"F/21935-2 \"Kantunil-Cancún\"","09124"]
[157,"F/31293-4 Libramiento Oriente de San Luis Potosí","09122"]
[158,"F/689 San Martín Texmelucan-Tlaxcala-El Molinito","09131"]
[159,"Ferrocarril del Istmo de Tehuantepec, S.A. de C.V.","09189"]
[160,"Ferrocarriles Nacionales de México","06815"]
[161,"Fid. 122.- Benjamín Hill Trabajadores F.F.C.C. Sonora-Baja California","09003"]
[162,"Fid. 1327.- Gobierno Federal, Programa de vivienda para magistrados y jueces del Poder Judicial Federal","06008"]
[163,"Fid. 2065.- Plan de pensiones de los jubilados de BANOBRAS","06322"]
[164,"Fid. 2160 Fondo de pensiones de contribución definida","06323"]
[165,"Fid. 285.-Promotora de desarrollo urbano.- Fraccionamiento Bosques del Valle Coacalco","06003"]
[166,"Fid. 294.- Colonia Petrolera José Escandón","18672"]
[167,"Fid. 351.- Unidad Morazán","06001"]
[168,"Fideicomiso 11029386 (antes SM940243) Gómez Palacio-Cuencamé-Yerbanis","09132"]
[169,"Fideicomiso 14780-8 Fondo Nacional para Escuelas de Calidad","11019"]
[170,"Fideicomiso 148687 \"Fondo para préstamos a corto plazo para apoyar a los trabajadores de CAPUFE en casos de contingencia\"","09126"]
[171,"Fideicomiso 1725-1-Para integrar diversos fondos (Patrimonial)","11091"]
[172,"Fideicomiso 1738-3-Ciencia y Tecnología","11092"]
[173,"Fideicomiso 1936 Fondo Nacional de Infraestructura","06321"]
[174,"Fideicomiso 2003 \"Fondo de Desastres Naturales\"","06010"]
[175,"Fideicomiso 2165-8 \"Fondo para liquidación de trabajadores de la red FONADIN\" (Antes FARAC)","09125"]
[176,"Fideicomiso 5012-6 FERRONALESJUB (para el pago de pensiones jubilatorias a los trabajadores de Ferrocarriles Nacionales de México) ","06816"]
[177,"Fideicomiso a favor de los hijos del personal adscrito al Estado Mayor Presidencial","02102"]
[178,"Fideicomiso Ángeles Verdes","21003"]
[179,"Fideicomiso Barrancas del Cobre","21162"]
[180,"Fideicomiso Centro de Ingeniería y Desarrollo Industrial No. 135826-8","11122"]
[181,"Fideicomiso Centro de Investigación en Alimentación y Desarrollo, A.C. (CIAD)","11184"]
[182,"Fideicomiso Centro de Investigaciones Biológicas del Noroeste, S.C.","11207"]
[183,"Fideicomiso Centro de Investigaciones en Óptica, A.C. No. 040026-8","11180"]
[184,"Fideicomiso de administración de gastos previos","18167"]
[185,"Fideicomiso de administración de teatros y salas de espectáculos IMSS","00642"]
[186,"Fideicomiso de administración e inversión para el establecimiento y operación de los fondos de apoyo a la investigación científica y desarrollo tecnológico del INIFAP","08171"]
[187,"Fideicomiso de administración e Inversión para el manejo del fondo de ahorro de los trabajadores del Fondo de Cultura Económica","11250"]
[188,"Fideicomiso de administración e inversión para pensiones de los trabajadores","14221"]
[189,"Fideicomiso de administración para el otorgamiento y primas de antigüedad","06802"]
[190,"Fideicomiso de administración y garantía complementaria Fondo 95","15001"]
[191,"Fideicomiso de Administración y Pago CENAGAS-BANCOMEXT número 10637",18114]
[192,"Fideicomiso de administración y traslativo de dominio (Obras de Infraestructura para el Sistema Eléctrico Federal)","18168"]
[193,"Fideicomiso de administración, inversión y pago número 013 ANP Valle de Bravo","16152"]
[194,"Fideicomiso de apoyo a deudos de militares fallecidos o a militares que hayan adquirido una inutilidad en primera categoría en actos del servicio considerado de alto riesgo","07001"]
[195,"Fideicomiso de apoyo a la investigación científica y desarrollo tecnológico del Colegio de Postgraduados","08141"]
[196,"Fideicomiso de apoyo a las exportaciones FIDAPEX","06314"]
[197,"Fideicomiso de apoyo a los propietarios rurales en Chiapas (FIAPAR)","15002"]
[198,"Fideicomiso de apoyos médicos complementarios y de apoyo económico extraordinario para los servidores públicos del Poder Judicial de la Federación, con excepción de los de la Suprema Corte de Justicia de la Nación","03102"]
[199,"Fideicomiso de beneficios sociales (FIBESO)","00643"]
{"$rows_left_out":646}